unable to build on 7.2 redhat

Sid.Young@qml.com.au Sid.Young@qml.com.au
Sun, 1 Jun 2003 14:13:53 +1000

Hi all,

I am new to libgcrypt and while trying to build the release on RedHat 7.2
(Intel platform) I get the following error with reguard to a version script.

Any ideas what I am doing wrong ?

Making all in src
make[2]: Entering directory `/opt/mqlink/src/libgcrypt-1.1.11/src'
/bin/sh ../libtool --mode=link gcc  -g -O2 -Wall   -o libgcrypt.la -rpath
ocal/lib -Wl,--version-script=./libgcrypt.vers -version-info 6:0:5  misc.lo
al.lo sexp.lo stdmem.lo secmem.lo missing-string.lo ath.lo ath-pthread.lo
pher/libcipher.la  ../mpi/libmpi.la -lnsl  -lnsl
rm -fr .libs/libgcrypt.la .libs/libgcrypt.* .libs/libgcrypt.*
gcc -shared  misc.lo global.lo sexp.lo stdmem.lo secmem.lo missing-string.lo
.lo ath-pthread.lo -Wl,--whole-archive ../cipher/.libs/libcipher.al
/libmpi.al -Wl,--no-whole-archive  ../cipher/.libs/libcipher.al
mpi.al -lnsl    -Wl,--version-script=./libgcrypt.vers -Wl,-soname
so.1 -o .libs/libgcrypt.so.1.5.0
/usr/bin/ld:./libgcrypt.vers:21: parse error in VERSION script
collect2: ld returned 1 exit status
make[2]: *** [libgcrypt.la] Error 1
make[2]: Leaving directory `/opt/mqlink/src/libgcrypt-1.1.11/src'
make[1]: *** [all-recursive] Error 1
make[1]: Leaving directory `/opt/mqlink/src/libgcrypt-1.1.11'
make: *** [all] Error 2

Sid Young