compile errors continued

Matthias Wachs wachs at
Mon Dec 16 10:41:21 CET 2013


while updating our buildbots I got another compile error:

On a OS X machine:

Darwin 11.3.0 Darwin Kernel Version 11.3.0: Thu Jan
12 18:47:41 PST 2012; root:xnu-1699.24.23~1/RELEASE_X86_64 x86_64

/bin/sh ../libtool  --tag=CC   --mode=compile gcc -DHAVE_CONFIG_H -I.
-I..  -I../src -I../src -I/opt/local/include -I/opt/local/include -g -O2
-Wall -MT mpih-div.lo -MD -MP -MF .deps/mpih-div.Tpo -c -o mpih-div.lo
libtool: compile:  gcc -DHAVE_CONFIG_H -I. -I.. -I../src -I../src
-I/opt/local/include -I/opt/local/include -g -O2 -Wall -MT mpih-div.lo
-MD -MP -MF .deps/mpih-div.Tpo -c mpih-div.c  -fno-common -DPIC -o
mpih-div.c: In function '_gcry_mpih_mod_1':
mpih-div.c:183: error: unsupported inline asm: input constraint with a
matching output constraint of incompatible type!
make[2]: *** [mpih-div.lo] Error 1
make[1]: *** [all-recursive] Error 1
make: *** [all] Error 2


Dipl.-Inf. Matthias Wachs
Free Secure Network Systems Group
Technische Universitaet Muenchen
Chair for Network Architectures and Services
Institute for Informatics / I8           Tel:    +49 89 289 18037
Boltzmannstr. 3 / Room 03.05.042         Fax:    +49 89 289 18033
D-85748 Garching b. Muenchen, Germany    Email: wachs at

-------------- next part --------------
A non-text attachment was scrubbed...
Name: signature.asc
Type: application/pgp-signature
Size: 555 bytes
Desc: OpenPGP digital signature
URL: </pipermail/attachments/20131216/bbe3d873/attachment.sig>

More information about the Gcrypt-devel mailing list