Compile errors

Brian Holgate brian at
Sat Aug 8 18:27:59 CEST 1998

This is I think my fifth upgrade of gpg now and the first one with compile
Verified pgp signature.
Ran ./configure without complaint.
Then 'make` bombed out with

make all-recursive
Making all in po
make[2]: Entering directory `/home/brian/src/gnupg-0.3.3/po'
PATH=../src:$PATH : --default-domain=gnupg --directory=.. \
  --add-comments --keyword=_ --keyword=N_ \
rm -f ./gnupg.pot
mv gnupg.po ./gnupg.pot
mv: gnupg.po: No such file or directory
make[2]: *** [gnupg.pot] Error 1
make[2]: Leaving directory `/home/brian/src/gnupg-0.3.3/po'
make[1]: *** [all-recursive] Error 1
make[1]: Leaving directory `/home/brian/src/gnupg-0.3.3'
make: *** [all-recursive-am] Error 2

More information about the Gnupg-devel mailing list