Fails on make check

Fabio Coatti cova at
Mon Nov 9 01:53:54 CET 1998

I've built GnuPG 0.4.3 under Linux RH 5.1 i386, egcs 1.0.2
the make check gives the following: (I've extracted the error messages)

rpm:~/BUILD/gnupg-0.4.3$ make check | grep FAIL
cmp: EOF on plain-1
encryptp.test: plain-1: mismatch
FAIL: encryptp.test
cmp: EOF on plain-1
armencryptp.test: plain-1: mismatch
FAIL: armencryptp.test
Cosa scegli? FAIL: genkey1024.test
make[3]: *** [check-TESTS] Error 1
make[2]: *** [check] Error 2
make[1]: *** [check-recursive] Error 1
make: *** [check] Error 2                       

But if I set the LANG environment variable to "en", instead of "it", all
goes fine.  

Is there a problem with tests or is a problem of gpg itself? If it's related
only to check section, LANG should be unset by make check, I think.

Fabio Coatti               
Ferrara Linux Users Group
GnuPG fp:6AB9 277E 9AA7 9D20 E82C  9EE7 2D17 E351 3DCB 0CDC
Old SysOps never die... they simply forget their password.

-------------- next part --------------
A non-text attachment was scrubbed...
Name: not available
Type: application/pgp-signature
Size: 249 bytes
Desc: not available
Url : /pipermail/attachments/19981109/ba75558d/attachment.bin

More information about the Gnupg-devel mailing list