Git Compile Error

Kevin Hilton kevhilton at
Mon Mar 7 03:46:10 CET 2011

Not that I'm helping to much, however this is what I'm getting pulling the
latest git developmental branch when trying to build:

ecdh.c: In function `pk_ecdh_encrypt_with_shared_point':
ecdh.c:255: error: `GCRY_CIPHER_MODE_AESWRAP' undeclared (first use in this
ecdh.c:255: error: (Each undeclared identifier is reported only once
ecdh.c:255: error: for each function it appears in.)
make[2]: *** [ecdh.o] Error 1
make[2]: Leaving directory `/home/admin/src/gnupg/g10'
make[1]: *** [all-recursive] Error 1
make[1]: Leaving directory `/home/admin/src/gnupg'
make: *** [all] Error 2
-------------- next part --------------
An HTML attachment was scrubbed...
URL: </pipermail/attachments/20110306/34a43bd2/attachment.htm>

More information about the Gnupg-devel mailing list