Cannot build 2.1 beta 6 on Mac OSX 10.9.4

Charles Diza chdiza at
Sun Aug 31 01:21:11 CEST 2014

I tried to build the sixth beta of 2.1 on Mac OSX 10.9.4.  All the prereq's
build fine, but when building gnupg2 it always fails here:

gcc -I/usr/local/Cellar/libgcrypt/1.6.2/include
-I/usr/local/Cellar/libgpg-error/1.13/include -g -O2 -Wall
-Wno-pointer-sign -Wpointer-arith   -o t-openpgp-oid t-openpgp-oid.o
libcommon.a ../gl/libgnu.a -L/usr/local/Cellar/libgcrypt/1.6.2/lib -lgcrypt
-L/usr/local/Cellar/libgpg-error/1.13/lib -lgpg-error
-L/usr/local/Cellar/libassuan/2.1.2/lib -lassuan
-L/usr/local/Cellar/libgpg-error/1.13/lib -lgpg-error
-L/usr/local/Cellar/libgpg-error/1.13/lib -lgpg-error  -liconv
Undefined symbols for architecture x86_64:
  "_default_errsource", referenced from:
      _parse_ber_header in libcommon.a(libcommon_a-tlv.o)
      _parse_sexp in libcommon.a(libcommon_a-tlv.o)
ld: symbol(s) not found for architecture x86_64
clang: error: linker command failed with exit code 1 (use -v to see
make[3]: *** [t-sexputil] Error 1
make[3]: *** Waiting for unfinished jobs....
make[2]: *** [all] Error 2
make[1]: *** [all-recursive] Error 1
make: *** [all] Error 2

Let me know if you want more information.

-------------- next part --------------
An HTML attachment was scrubbed...
URL: </pipermail/attachments/20140830/08e032ee/attachment.html>

More information about the Gnupg-devel mailing list