Install Errors

Rudichuk, Jeff ED0
Thu, 29 Jun 2000 15:54:16 -0600

I am installing gnupgp-1.0.1 on a Sun Ultra 10 running Solaris 2.6.  I am
also using gnumake.

The ./configure and gmake commands appear to execute with no problems, but
when I run gmake install this is the error I receive:

Making install in cipher
gmake[1]: Entering directory `/spare/src/gnupg-1.0.1/cipher'
gmake[2]: Entering directory `/spare/src/gnupg-1.0.1/cipher'
/bin/sh ../scripts/mkinstalldirs /usr/local/lib/gnupg
  /usr/bin/install -c  rndunix /usr/local/lib/gnupg/rndunix
cp: cannot access /usr/local/lib/gnupg/rndunix
install: cp /usr/local/lib/gnupg/rndunix rndunix/rndunix failed
  /usr/bin/install -c  rndegd /usr/local/lib/gnupg/rndegd
cp: cannot access /usr/local/lib/gnupg/rndegd
install: cp /usr/local/lib/gnupg/rndegd rndegd/rndegd failed
  /usr/bin/install -c  tiger /usr/local/lib/gnupg/tiger
cp: cannot access /usr/local/lib/gnupg/tiger
install: cp /usr/local/lib/gnupg/tiger tiger/tiger failed
gmake[2]: *** [install-pkglibPROGRAMS] Error 2
gmake[2]: Leaving directory `/spare/src/gnupg-1.0.1/cipher'
gmake[1]: *** [install-am] Error 2
gmake[1]: Leaving directory `/spare/src/gnupg-1.0.1/cipher'
gmake: *** [install-recursive] Error 1

Can you offer any solutions?

Please CC me as I am not on the mailing list.

Jeff Rudichuk
Pgr: 566-0388
Ph: 787-6009