make error

Bernard Fay
Tue Jan 1 18:28:01 2002

I got the following error while trying to compile:

../g10/gpg --homedir . --quiet --yes --import ./pubdemo.asc
gpg: ../cipher/tiger: error loading extension: cannot open shared object
file: cannot load shared object file: No such file or directory
make[2]: *** [prepared.stamp] Error 2
make[2]: Leaving directory `/usr/src/gnupg-1.0.6/checks'
make[1]: *** [all-recursive] Error 1
make[1]: Leaving directory `/usr/src/gnupg-1.0.6'
make: *** [all-recursive-am] Error 2

I use gcc 3.0.2 and glibc 2.2.3.

Any help will be appreciated.