Solaris error (bftest)

Marco Kunst marcokunst@yahoo.fr
Fri Oct 25 00:55:01 2002


--0-1472290190-1035500196=:23509
Content-Type: text/plain; charset=iso-8859-1
Content-Transfer-Encoding: 8bit


Please, my compilation (Sun Solaris 5.8) found a error in this place:

Undefined                       first referenced
symbol                             in file
socket                              ../cipher/libcipher.a(rndegd.o)
connect                             ../cipher/libcipher.a(rndegd.o)
ld: fatal: Symbol referencing errors. No output written to bftest
collect2: ld returned 1 exit status
make[2]: *** [bftest] Error 1
make[2]: Leaving directory `/home/gnupg-1.2.0/tools'
make[1]: *** [all-recursive] Error 1
make[1]: Leaving directory `/home/gnupg-1.2.0'
make: *** [all] Error 2

The list users can help me?

(**Please CC to my email marcokunst@yahoo.fr**)

Thanks in advance!


----------------------------------------------()-
Marco Kunt - marcokunst@yahoo.fr


---------------------------------
Yahoo! Mail -- Une adresse @yahoo.fr gratuite et en franšais !

--0-1472290190-1035500196=:23509
Content-Type: text/html; charset=iso-8859-1
Content-Transfer-Encoding: 8bit

<P>Please, my compilation (Sun Solaris 5.8) found a error in this place:</P>
<P>Undefined&nbsp;&nbsp;&nbsp;&nbsp;&nbsp;&nbsp;&nbsp;&nbsp;&nbsp;&nbsp;&nbsp;&nbsp;&nbsp;&nbsp;&nbsp;&nbsp;&nbsp;&nbsp;&nbsp;&nbsp;&nbsp;&nbsp; first referenced<BR>symbol&nbsp;&nbsp;&nbsp;&nbsp;&nbsp;&nbsp;&nbsp;&nbsp;&nbsp;&nbsp;&nbsp;&nbsp;&nbsp;&nbsp;&nbsp;&nbsp;&nbsp;&nbsp;&nbsp;&nbsp;&nbsp;&nbsp;&nbsp;&nbsp;&nbsp;&nbsp;&nbsp;&nbsp; in file<BR>socket&nbsp;&nbsp;&nbsp;&nbsp;&nbsp;&nbsp;&nbsp;&nbsp;&nbsp;&nbsp;&nbsp;&nbsp;&nbsp;&nbsp;&nbsp;&nbsp;&nbsp;&nbsp;&nbsp;&nbsp;&nbsp;&nbsp;&nbsp;&nbsp;&nbsp;&nbsp;&nbsp;&nbsp;&nbsp; ../cipher/libcipher.a(rndegd.o)<BR>connect&nbsp;&nbsp;&nbsp;&nbsp;&nbsp;&nbsp;&nbsp;&nbsp;&nbsp;&nbsp;&nbsp;&nbsp;&nbsp;&nbsp;&nbsp;&nbsp;&nbsp;&nbsp;&nbsp;&nbsp;&nbsp;&nbsp;&nbsp;&nbsp;&nbsp;&nbsp;&nbsp;&nbsp; ../cipher/libcipher.a(rndegd.o)<BR>ld: fatal: Symbol referencing errors. No output written to bftest<BR>collect2: ld returned 1 exit status<BR>make[2]: *** [bftest] Error 1<BR>make[2]: Leaving directory `/home/gnupg-1.2.0/tools'<BR>make[1]: *** [all-recursive] Error 1<BR>make[1]: Leaving directory `/home/gnupg-1.2.0'<BR>make: *** [all] Error 2</P>
<P>The list users&nbsp;can help me?</P>
<P>(**Please CC to my email <A href="http://fr.f107.mail.yahoo.com/ym/Compose?To=marcokunst@yahoo.fr" target=_blank>marcokunst@yahoo.fr</A>**)</P>
<P>Thanks in advance!</P><BR><BR>----------------------------------------------()-<br>Marco Kunt - marcokunst@yahoo.fr<p><br><hr size=1><a href="http://fr.mail.yahoo.com">Yahoo! Mail</a> -- Une adresse @yahoo.fr gratuite et en franšais !<br>
--0-1472290190-1035500196=:23509--