Please Help - Compilation Failed on Solaris 8
Tue Jan 14 17:12:02 2003


I'm attempting to compile gnupg 1.2.1 on Solaris 8 but am getting an =
error.  The details are below.  Any help would be greatly appreciated.

Best Regards,

Owen Singleton

gcc -DHAVE_CONFIG_H -I. -I. -I.. -I.. -I../include -I../intl    -g -O2 =
-Wall -c `test -f 'misc.c' || echo './'`misc.c
In file included from misc.c:35:
/usr/include/sys/resource.h:193: warning: `struct rlimit64' declared =
inside parameter list
/usr/include/sys/resource.h:193: warning: its scope is only this =
definition or declaration,
/usr/include/sys/resource.h:193: warning: which is probably not what you =
/usr/include/sys/resource.h:194: warning: `struct rlimit64' declared =
inside parameter list
misc.c: In function `disable_core_dumps':
misc.c:91: storage size of `limit' isn't known
misc.c:91: warning: unused variable `limit'
make[2]: *** [misc.o] Error 1
make[2]: Leaving directory `/home/singleow/gnupg-1.2.1/g10'
make[1]: *** [all-recursive] Error 1
make[1]: Leaving directory `/home/singleow/gnupg-1.2.1'
make: *** [all] Error=20

Visit our website at

This message contains confidential information and is intended only 
for the individual named.  If you are not the named addressee you 
should not disseminate, distribute or copy this e-mail.  Please 
notify the sender immediately by e-mail if you have received this 
e-mail by mistake and delete this e-mail from your system.

E-mail transmission cannot be guaranteed to be secure or error-free 
as information could be intercepted, corrupted, lost, destroyed, 
arrive late or incomplete, or contain viruses.  The sender therefore 
does not accept liability for any errors or omissions in the contents 
of this message which arise as a result of e-mail transmission.  If 
verification is required please request a hard-copy version.  This 
message is provided for informational purposes and should not be 
construed as a solicitation or offer to buy or sell any securities or 
related financial instruments.