compile errors

Derick Centeno aguilarojo at
Mon Nov 1 03:24:12 CET 2010

Hi Everyone!

I was compiling the latest version of gnupg 2.0.16. The configure
process completed well, but the make process failed as follows:

Making all in tests
make[2]: Entering directory `/usr/src/gnupg-2.0.16/tests'
Making all in openpgp
make[3]: Entering directory `/usr/src/gnupg-2.0.16/tests/openpgp'
./gpg_dearmor > ./plain-3 < ./plain-3o.asc
../../g10/gpg2: error while loading shared libraries: cannot open shared object file: No such file or directory
make[3]: *** [plain-3] Error 127
make[3]: Leaving directory `/usr/src/gnupg-2.0.16/tests/openpgp'
make[2]: *** [all-recursive] Error 1
make[2]: Leaving directory `/usr/src/gnupg-2.0.16/tests'
make[1]: *** [all-recursive] Error 1
make[1]: Leaving directory `/usr/src/gnupg-2.0.16'
make: *** [all] Error 2

I'd appreciate learning how to resolve this problem.

Refranes/Popular sayings:
The Taino say:
No hay mal que por bien no venga.
There is no evil out of which good cannot blossom.
-------------- next part --------------
A non-text attachment was scrubbed...
Name: signature.asc
Type: application/pgp-signature
Size: 189 bytes
Desc: not available
URL: </pipermail/attachments/20101031/e0ffc5d0/attachment.pgp>

More information about the Gnupg-users mailing list