build error on Linux/m68k

James Troup J.J.Troup at
Sun Feb 22 18:52:59 CET 1998


I got the following error trying to build 0.2.7 on my Falcon.

gcc -DHAVE_CONFIG_H -I. -I. -I.. -I../include  -O2 -g -Wall -c mpih-shift.S
mpih-shift.S: Assembler messages:
mpih-shift.S:245: Fatal error: Symbol .Lspecial already defined.
make[3]: *** [mpih-shift.o] Error 1
make[3]: Leaving directory `/home/james/packages/g10/g10-0.2.7/mpi'
make[2]: *** [all-recursive] Error 1
make[2]: Leaving directory `/home/james/packages/g10/g10-0.2.7'
make[1]: *** [all-recursive-am] Error 2
make[1]: Leaving directory `/home/james/packages/g10/g10-0.2.7'
make: *** [build] Error 2
07:21:30 at transmet|~/packages/g10/g10-0.2.7 $


More information about the Gnupg-devel mailing list