gnupg wo't compile

Thu Nov 8 23:25:01 2001

when i do ./configure;gmake i end up with this

Making all in util
gmake[2]: Entering directory `/usr/local/src/gnupg-1.0.6/util'
gcc -DHAVE_CONFIG_H -I. -I. -I.. -I../include -I../intl  -I/usr/local/includ
e  -g -O2 -Wall -c miscutil.c
miscutil.c: In function `asctimestamp':
miscutil.c:160: warning: implicit declaration of function `nl_langinfo'
miscutil.c:160: `D_T_FMT' undeclared (first use in this function)
miscutil.c:160: (Each undeclared identifier is reported only once
miscutil.c:160: for each function it appears in.)
miscutil.c:160: warning: passing arg 2 of `mem2str' makes pointer from
integer without a cast
gmake[2]: *** [miscutil.o] Error 1
gmake[2]: Leaving directory `/usr/local/src/gnupg-1.0.6/util'
gmake[1]: *** [all-recursive] Error 1
gmake[1]: Leaving directory `/usr/local/src/gnupg-1.0.6'
gmake: *** [all-recursive-am] Error 2

anyone have any ideas?