libgpg-error build error

Ingo Klöcker kloecker at
Mon Mar 1 19:31:04 CET 2021

On Montag, 1. März 2021 10:25:13 CET Josef via Gnupg-users wrote:
> I was trying to build following the instructions on the readme
> file(autogen,configure..) and the make command was failing with the
> following error:
> gpgrt.texi:4: @include: could not find version.texi
> gpgrt.texi:11: warning: undefined flag: VERSION
> gpgrt.texi:12: warning: undefined flag: UPDATED
> gpgrt.texi:57: warning: undefined flag: VERSION
> gpgrt.texi:58: warning: undefined flag: UPDATED
> make[2]: *** [Makefile:603:] Error 1
> make[2]: Leaving directory '/home/jo/remove/libgpg-error/doc'
> make[1]: *** [Makefile:514: all-recursive] Error 1
> make[1]: Leaving directory '/home/jo/remove/libgpg-error'
> make: *** [Makefile:446: all] Error 2
> I don't know if I was doing something wrong

Please tell us exactly which commands you used and what the output of the 
commands was, so that we can figure out what went wrong.

-------------- next part --------------
A non-text attachment was scrubbed...
Name: signature.asc
Type: application/pgp-signature
Size: 195 bytes
Desc: This is a digitally signed message part.
URL: <>

More information about the Gnupg-users mailing list