libgpg-error build error

Josef josef.grieb at
Mon Mar 1 10:25:13 CET 2021

I was trying to build following the instructions on the readme
file(autogen,configure..) and the make command was failing with the
following error:

gpgrt.texi:4: @include: could not find version.texi
gpgrt.texi:11: warning: undefined flag: VERSION
gpgrt.texi:12: warning: undefined flag: UPDATED
gpgrt.texi:57: warning: undefined flag: VERSION
gpgrt.texi:58: warning: undefined flag: UPDATED
make[2]: *** [Makefile:603:] Error 1
make[2]: Leaving directory '/home/jo/remove/libgpg-error/doc'
make[1]: *** [Makefile:514: all-recursive] Error 1
make[1]: Leaving directory '/home/jo/remove/libgpg-error'
make: *** [Makefile:446: all] Error 2

I don't know if I was doing something wrong


More information about the Gnupg-users mailing list